{"text_format":"1","workbook":"xlsx","n_sheets":11,"sheets":["User's instructions","Input","Data","ES (Synth table)","Report Indic-Comp","ES-Scores","PivotTable","Report Indic (Radar)","Dim_PEFA","Profile","colors"],"not_rendered":{"charts":5,"images":2,"macros":1,"external_links":0,"defined_names":8,"comments":0,"pivot_tables":1},"unopened":[],"bounds":{"document_bytes":16777216,"sheet_cells":100000,"rows_first":2000,"rows_last":500,"rows_between":2000,"halvings":0,"cell_chars":16384,"cell_head_chars":4096},"cells_cut":0,"cells_raw":0,"read":"whole","date_system":"1900"}

{"sheet":"User's instructions","index":0,"n_rows":39,"n_cols":3,"rows_kept":39,"cut":false,"hidden":false,"merged":[]}
[]
[null,null,"1. Unblock the Excel file after downloading the Excel file from the Internet"]
[]
[]
[]
[]
[]
[]
[]
[]
{"$rows_left_out":30}
{"sheet":"Input","index":1,"n_rows":30,"n_cols":15,"rows_kept":30,"cut":false,"hidden":false,"merged":[[3,1,3,2],[2,10,3,10]]}
[]
[null,null,{"$f":"Profile!G3","v":"Team Leader"}]
[null,null,{"$f":"Profile!G4","v":"Country"},"Pefalia",null,null,null,null,"Status",null,{"$f":"Profile!G6","v":"Evaluation PEFA Gender"}]
[null,{"$f":"Profile!G5","v":"Evaluation year"},null,2019,"Evaluation précédente",null,"Evaluation précédente"]
[]
[null,null,null,"Global numerical scoring",{"$f":"AVERAGE(H10,H13,H15,H17,H19,H22,H24,H26,H28)","v":0},{"$f":"AVERAGE(I10,I13,I15,I17,I19,I22,I24,I26,I28)","v":1.5}]
[null,null,null,"Global scoring",{"$f":"IF(E6>3.65,\"A\",\nIF(E6>=3.25,\"B+\",\nIF(E6>2.5,\"B\",\nIF(E6>=2.25,\"C+\",\nIF(E6>1.25,\"C\",\nIF(E6>1.25,\"D+\",\nIF(E6>0,\"D\",\n\"\"\n)))))))","v":""},{"$f":"IF(F6>3.65,\"A\",\nIF(F6>=3.25,\"B+\",\nIF(F6>2.5,\"B\",\nIF(F6>=2.25,\"C+\",\nIF(F6>1.25,\"C\",\nIF(F6>1.25,\"D+\",\nIF(F6>0,\"D\",\n\"\"\n)))))))","v":"C"},null,null,null,{"$f":"IF(H6>=3.25,\"A\",\nIF(H6>=3.25,\"B+\",\nIF(H6>2.5,\"B\",\nIF(H6>=2.25,\"C+\",\nIF(H6>1.25,\"C\",\nIF(H6>1.25,\"D+\",\nIF(AND(H6<=1.25,J6>0),\"D\",\n\"\"\n)))))))","v":""}]
[null,null,null,"Performance",{"$f":"IF(E6>=3.25,\"AVANCE\",\nIF(E6>2.5,\"BON\",\nIF(E6>1.25,\"BASIQUE\",\nIF(E6>=1,\"FAIBLE\",\n\"\"\n))))","v":""},{"$f":"IF(F6>=3.25,Profile!$G$7,\nIF(F6>2.5,Profile!$G$8,\nIF(F6>1.25,Profile!$G$9,\nProfile!$G$10)))","v":"2. BASIC"}]
["Type","Method","ID","Dimension",{"$f":"J4","v":0},{"$f":"\"Score \"&D4","v":"Score 2019"},"Comparable (1/0)","Score num (Prev)","Score num (Curr)","Evolution",{"$f":"\"Justification \"&D4","v":"Justification 2019"},{"$f":"Profile!G2","v":"Justification for the evolution"},{"$f":"\"Performance \"&D4","v":"Performance 2019"},{"$f":"\"Performance \"&E9","v":"Performance 0"},"Desag"]
["Indic","M1","GRPFM-1",{"$f":"VLOOKUP(C10,Dim_PEFA!A:B,2,FALSE)","v":"Gender impact analysis of budget policy proposals"},{"$f":"IF(AND(E11=\"NU\",E12=\"NU\"),\"NU\",\nIF(AND(OR(E11=\"NA\",E11=\"NU\"),OR(E12=\"NA\",E12=\"NU\")),\"NA\",\nIF(H10>=3.25,\"A\",\nIF(H10>=3.25,\"B+\",\nIF(H10>2.5,\"B\",\nIF(H10>=2.25,\"C+\",\nIF(H10>1.25,\"C\",\nIF(H10>1.25,\"D+\",\nIF(AND(H10<=1.25,H10>0),\"D\",\n\"\"\n)))))))))","v":""},{"$f":"IF(AND(F11=\"NU\",F12=\"NU\"),\"NU\",\nIF(AND(OR(F11=\"NA\",F11=\"NU\"),OR(F12=\"NA\",F12=\"NU\")),\"NA\",\nIF(I10>3.65,\"A\",\nIF(I10>=3.25,\"B+\",\nIF(I10>2.65,\"B\",\nIF(I10>=2.25,\"C+\",\nIF(I10>1.75,\"C\",\nIF(I10>1.25,\"D+\",\nIF(AND(I10<=1.25,I10>0),\"D\",\n\"\"\n)))))))))","v":"D+"},{"$f":"AVERAGE(G11:G12)","v":1},{"$f":"IFERROR(IF($B10=\"M1\",IF(ROUND(AVERAGEIF(H11:H12,\">0\"),1)=ROUND(_xlfn.MINIFS(H11:H12,H11:H12,\">0\"),1),ROUND(AVERAGEIF(H11:H12,\">0\"),1),_xlfn.MINIFS(H11:H12,H11:H12,\">0\")+0.5),AVERAGEIF(H11:H12,\">0\")),0)","v":0},{"$f":"IFERROR(IF($B10=\"M1\",IF(ROUND(AVERAGEIF(I11:I12,\">0\"),1)=ROUND(_xlfn.MINIFS(I11:I12,I11:I12,\">0\"),1),ROUND(AVERAGEIF(I11:I12,\">0\"),1),_xlfn.MINIFS(I11:I12,I11:I12,\">0\")+0.5),AVERAGEIF(I11:I12,\">0\")),0)","v":1.5},{"$f":"IFERROR(IF(G10=1,IF(I10-H10<0,\"-\",IF(I10-H10>0,\"+\",\"=\")),\"N.C\"),\"N.C.\")","v":"+"},null,null,{"$f":"IF(I10>=3.25,Profile!$G$7,\nIF(I10>2.5,Profile!$G$8,\nIF(I10>1.25,Profile!$G$9,\nProfile!$G$10)))","v":"2. BASIC"},{"$f":"IF(H10>=3.25,\"4. AVANCE\",\nIF(H10>2.5,\"3. BON\",\nIF(H10>1.25,\"2. BASIQUE\",\n\"1. FAIBLE\"\n)))","v":"1. FAIBLE"},2]
{"$rows_left_out":21}
{"sheet":"Data","index":2,"n_rows":43,"n_cols":26,"rows_kept":43,"cut":false,"hidden":true,"merged":[]}
["#","PEFA Methdology","Locality Name","ID_Locality","Period","Year","Month","Date","ID_Ind","ID_Comp","ID","Method","Code_Indic","Indicator","Code_Comp","Component","Dimension Order","Type Indic","Score","Score Num","Performance","AVG Num","Min Num","Min NumC","Sum Num","AVG PEFA"]
[{"$f":"ROW(A1)","v":1},"GRPFM",{"$f":"Input!$D$3","v":"Pefalia"},{"$f":"LEFT(Table1[[#This Row],[Locality Name]],5)","v":"Pefal"},"Current",{"$f":"Input!$D$4","v":2019},null,null,1,null,{"$f":"Table1[[#This Row],[ID_Locality]]&\".\"&Table1[[#This Row],[ID_Ind]]&Table1[[#This Row],[ID_Comp]]","v":"Pefal.1"},1,"GRPFM-1",{"$f":"VLOOKUP(Table1[[#This Row],[Code_Indic]],Dim_PEFA!$A$2:$B$13,2,FALSE)","v":"Gender impact analysis of budget policy proposals"},null,null,1,1,{"$f":"VLOOKUP($M2,Input!$C$10:$I$30,4,FALSE)","v":"D+"},{"$f":"VLOOKUP($M2,Input!$C$10:$I$30,7,FALSE)","v":1.5},{"$f":"IF(T2>=3.25,\"4. AVANCE\",\nIF(T2>2.5,\"3. BON\",\nIF(T2>1.25,\"2. BASIQUE\",\n\"1. FAIBLE\"\n)))","v":"2. BASIQUE"},{"$f":"IFERROR(AVERAGEIFS(Table1[Score Num],Table1[Year],Table1[[#This Row],[Year]],Table1[Code_Indic],Table1[[#This Row],[Code_Indic]],Table1[Score Num],\">0\"),0)","v":2.1666666666666665},{"$f":"_xlfn.MINIFS(Table1[Score Num],Table1[Date],Table1[[#This Row],[Date]],Table1[Code_Indic],Table1[[#This Row],[Code_Indic]],Table1[Score Num],\">0\")","v":0},{"$f":"IF(V2=W2,V2,W2+0.5)","v":0.5},{"$f":"SUMIFS(Table1[Score Num],Table1[Code_Indic],Table1[[#This Row],[Code_Indic]])","v":8},{"$f":"(IF(Table1[[#This Row],[Method]]=1,Table1[[#This Row],[Min NumC]],Table1[[#This Row],[AVG Num]]))","v":0.5}]
[2,"GRPFM",{"$f":"Input!$D$3","v":"Pefalia"},{"$f":"LEFT(Table1[[#This Row],[Locality Name]],5)","v":"Pefal"},"Current",{"$f":"Input!$D$4","v":2019},null,null,2,null,{"$f":"Table1[[#This Row],[ID_Locality]]&\".\"&Table1[[#This Row],[ID_Ind]]&Table1[[#This Row],[ID_Comp]]","v":"Pefal.2"},1,"GRPFM-2",{"$f":"VLOOKUP(Table1[[#This Row],[Code_Indic]],Dim_PEFA!$A$2:$B$13,2,FALSE)","v":"Gender responsive public investment management"},null,null,2,1,{"$f":"VLOOKUP($M3,Input!$C$10:$I$30,4,FALSE)","v":"A"},{"$f":"VLOOKUP($M3,Input!$C$10:$I$30,7,FALSE)","v":4},"4. AVANCE",{"$f":"IFERROR(AVERAGEIFS(Table1[Score Num],Table1[Year],Table1[[#This Row],[Year]],Table1[Code_Indic],Table1[[#This Row],[Code_Indic]],Table1[Score Num],\">0\"),0)","v":4},{"$f":"_xlfn.MINIFS(Table1[Score Num],Table1[Date],Table1[[#This Row],[Date]],Table1[Code_Indic],Table1[[#This Row],[Code_Indic]],Table1[Score Num],\">0\")","v":0},0.5,{"$f":"SUMIFS(Table1[Score Num],Table1[Code_Indic],Table1[[#This Row],[Code_Indic]])","v":12},{"$f":"(IF(Table1[[#This Row],[Method]]=1,Table1[[#This Row],[Min NumC]],Table1[[#This Row],[AVG Num]]))","v":0.5}]
[3,"GRPFM",{"$f":"Input!$D$3","v":"Pefalia"},{"$f":"LEFT(Table1[[#This Row],[Locality Name]],5)","v":"Pefal"},"Current",{"$f":"Input!$D$4","v":2019},null,null,3,null,{"$f":"Table1[[#This Row],[ID_Locality]]&\".\"&Table1[[#This Row],[ID_Ind]]&Table1[[#This Row],[ID_Comp]]","v":"Pefal.3"},1,"GRPFM-3",{"$f":"VLOOKUP(Table1[[#This Row],[Code_Indic]],Dim_PEFA!$A$2:$B$13,2,FALSE)","v":"Gender responsive budget circular"},null,null,3,1,{"$f":"VLOOKUP($M4,Input!$C$10:$I$30,4,FALSE)","v":"C"},{"$f":"VLOOKUP($M4,Input!$C$10:$I$30,7,FALSE)","v":2},"2. BASIQUE",{"$f":"IFERROR(AVERAGEIFS(Table1[Score Num],Table1[Year],Table1[[#This Row],[Year]],Table1[Code_Indic],Table1[[#This Row],[Code_Indic]],Table1[Score Num],\">0\"),0)","v":2},{"$f":"_xlfn.MINIFS(Table1[Score Num],Table1[Date],Table1[[#This Row],[Date]],Table1[Code_Indic],Table1[[#This Row],[Code_Indic]],Table1[Score Num],\">0\")","v":0},0.5,{"$f":"SUMIFS(Table1[Score Num],Table1[Code_Indic],Table1[[#This Row],[Code_Indic]])","v":6},{"$f":"(IF(Table1[[#This Row],[Method]]=1,Table1[[#This Row],[Min NumC]],Table1[[#This Row],[AVG Num]]))","v":0.5}]
[4,"GRPFM",{"$f":"Input!$D$3","v":"Pefalia"},{"$f":"LEFT(Table1[[#This Row],[Locality Name]],5)","v":"Pefal"},"Current",{"$f":"Input!$D$4","v":2019},null,null,4,null,{"$f":"Table1[[#This Row],[ID_Locality]]&\".\"&Table1[[#This Row],[ID_Ind]]&Table1[[#This Row],[ID_Comp]]","v":"Pefal.4"},1,"GRPFM-4",{"$f":"VLOOKUP(Table1[[#This Row],[Code_Indic]],Dim_PEFA!$A$2:$B$13,2,FALSE)","v":"Gender responsive budget proposal documentation"},null,null,4,1,{"$f":"VLOOKUP($M5,Input!$C$10:$I$30,4,FALSE)","v":"NA"},{"$f":"VLOOKUP($M5,Input!$C$10:$I$30,7,FALSE)","v":0},"1. FAIBLE",{"$f":"IFERROR(AVERAGEIFS(Table1[Score Num],Table1[Year],Table1[[#This Row],[Year]],Table1[Code_Indic],Table1[[#This Row],[Code_Indic]],Table1[Score Num],\">0\"),0)","v":0},{"$f":"_xlfn.MINIFS(Table1[Score Num],Table1[Date],Table1[[#This Row],[Date]],Table1[Code_Indic],Table1[[#This Row],[Code_Indic]],Table1[Score Num],\">0\")","v":0},0,{"$f":"SUMIFS(Table1[Score Num],Table1[Code_Indic],Table1[[#This Row],[Code_Indic]])","v":0},{"$f":"(IF(Table1[[#This Row],[Method]]=1,Table1[[#This Row],[Min NumC]],Table1[[#This Row],[AVG Num]]))","v":0}]
[5,"GRPFM",{"$f":"Input!$D$3","v":"Pefalia"},{"$f":"LEFT(Table1[[#This Row],[Locality Name]],5)","v":"Pefal"},"Current",{"$f":"Input!$D$4","v":2019},null,null,5,null,{"$f":"Table1[[#This Row],[ID_Locality]]&\".\"&Table1[[#This Row],[ID_Ind]]&Table1[[#This Row],[ID_Comp]]","v":"Pefal.5"},2,"GRPFM-5",{"$f":"VLOOKUP(Table1[[#This Row],[Code_Indic]],Dim_PEFA!$A$2:$B$13,2,FALSE)","v":"Sex-disaggregated performance information "},null,null,5,1,{"$f":"VLOOKUP($M6,Input!$C$10:$I$30,4,FALSE)","v":"D"},{"$f":"VLOOKUP($M6,Input!$C$10:$I$30,7,FALSE)","v":1},"1. FAIBLE",{"$f":"IFERROR(AVERAGEIFS(Table1[Score Num],Table1[Year],Table1[[#This Row],[Year]],Table1[Code_Indic],Table1[[#This Row],[Code_Indic]],Table1[Score Num],\">0\"),0)","v":1},{"$f":"_xlfn.MINIFS(Table1[Score Num],Table1[Date],Table1[[#This Row],[Date]],Table1[Code_Indic],Table1[[#This Row],[Code_Indic]],Table1[Score Num],\">0\")","v":0},0.5,{"$f":"SUMIFS(Table1[Score Num],Table1[Code_Indic],Table1[[#This Row],[Code_Indic]])","v":4},{"$f":"(IF(Table1[[#This Row],[Method]]=1,Table1[[#This Row],[Min NumC]],Table1[[#This Row],[AVG Num]]))","v":1}]
[6,"GRPFM",{"$f":"Input!$D$3","v":"Pefalia"},{"$f":"LEFT(Table1[[#This Row],[Locality Name]],5)","v":"Pefal"},"Current",{"$f":"Input!$D$4","v":2019},null,null,6,null,{"$f":"Table1[[#This Row],[ID_Locality]]&\".\"&Table1[[#This Row],[ID_Ind]]&Table1[[#This Row],[ID_Comp]]","v":"Pefal.6"},1,"GRPFM-6",{"$f":"VLOOKUP(Table1[[#This Row],[Code_Indic]],Dim_PEFA!$A$2:$B$13,2,FALSE)","v":"Tracking budget expenditure for gender equality"},null,null,6,1,{"$f":"VLOOKUP($M7,Input!$C$10:$I$30,4,FALSE)","v":"C"},{"$f":"VLOOKUP($M7,Input!$C$10:$I$30,7,FALSE)","v":2},"2. BASIQUE",{"$f":"IFERROR(AVERAGEIFS(Table1[Score Num],Table1[Year],Table1[[#This Row],[Year]],Table1[Code_Indic],Table1[[#This Row],[Code_Indic]],Table1[Score Num],\">0\"),0)","v":2},{"$f":"_xlfn.MINIFS(Table1[Score Num],Table1[Date],Table1[[#This Row],[Date]],Table1[Code_Indic],Table1[[#This Row],[Code_Indic]],Table1[Score Num],\">0\")","v":0},0.5,{"$f":"SUMIFS(Table1[Score Num],Table1[Code_Indic],Table1[[#This Row],[Code_Indic]])","v":6},{"$f":"(IF(Table1[[#This Row],[Method]]=1,Table1[[#This Row],[Min NumC]],Table1[[#This Row],[AVG Num]]))","v":0.5}]
[7,"GRPFM",{"$f":"Input!$D$3","v":"Pefalia"},{"$f":"LEFT(Table1[[#This Row],[Locality Name]],5)","v":"Pefal"},"Current",{"$f":"Input!$D$4","v":2019},null,null,7,null,{"$f":"Table1[[#This Row],[ID_Locality]]&\".\"&Table1[[#This Row],[ID_Ind]]&Table1[[#This Row],[ID_Comp]]","v":"Pefal.7"},1,"GRPFM-7",{"$f":"VLOOKUP(Table1[[#This Row],[Code_Indic]],Dim_PEFA!$A$2:$B$13,2,FALSE)","v":"Gender responsive reporting"},null,null,7,1,{"$f":"VLOOKUP($M8,Input!$C$10:$I$30,4,FALSE)","v":"D"},{"$f":"VLOOKUP($M8,Input!$C$10:$I$30,7,FALSE)","v":1},"1. FAIBLE",{"$f":"IFERROR(AVERAGEIFS(Table1[Score Num],Table1[Year],Table1[[#This Row],[Year]],Table1[Code_Indic],Table1[[#This Row],[Code_Indic]],Table1[Score Num],\">0\"),0)","v":1},{"$f":"_xlfn.MINIFS(Table1[Score Num],Table1[Date],Table1[[#This Row],[Date]],Table1[Code_Indic],Table1[[#This Row],[Code_Indic]],Table1[Score Num],\">0\")","v":0},0.5,{"$f":"SUMIFS(Table1[Score Num],Table1[Code_Indic],Table1[[#This Row],[Code_Indic]])","v":3},{"$f":"(IF(Table1[[#This Row],[Method]]=1,Table1[[#This Row],[Min NumC]],Table1[[#This Row],[AVG Num]]))","v":0.5}]
[8,"GRPFM",{"$f":"Input!$D$3","v":"Pefalia"},{"$f":"LEFT(Table1[[#This Row],[Locality Name]],5)","v":"Pefal"},"Current",{"$f":"Input!$D$4","v":2019},null,null,8,null,{"$f":"Table1[[#This Row],[ID_Locality]]&\".\"&Table1[[#This Row],[ID_Ind]]&Table1[[#This Row],[ID_Comp]]","v":"Pefal.8"},1,"GRPFM-8",{"$f":"VLOOKUP(Table1[[#This Row],[Code_Indic]],Dim_PEFA!$A$2:$B$13,2,FALSE)","v":"Evaluation of gender impacts of service delivery"},null,null,8,1,{"$f":"VLOOKUP($M9,Input!$C$10:$I$30,4,FALSE)","v":"D"},{"$f":"VLOOKUP($M9,Input!$C$10:$I$30,7,FALSE)","v":1},"1. FAIBLE",{"$f":"IFERROR(AVERAGEIFS(Table1[Score Num],Table1[Year],Table1[[#This Row],[Year]],Table1[Code_Indic],Table1[[#This Row],[Code_Indic]],Table1[Score Num],\">0\"),0)","v":1},{"$f":"_xlfn.MINIFS(Table1[Score Num],Table1[Date],Table1[[#This Row],[Date]],Table1[Code_Indic],Table1[[#This Row],[Code_Indic]],Table1[Score Num],\">0\")","v":0},0.5,{"$f":"SUMIFS(Table1[Score Num],Table1[Code_Indic],Table1[[#This Row],[Code_Indic]])","v":3},{"$f":"(IF(Table1[[#This Row],[Method]]=1,Table1[[#This Row],[Min NumC]],Table1[[#This Row],[AVG Num]]))","v":0.5}]
[9,"GRPFM",{"$f":"Input!$D$3","v":"Pefalia"},{"$f":"LEFT(Table1[[#This Row],[Locality Name]],5)","v":"Pefal"},"Current",{"$f":"Input!$D$4","v":2019},null,null,9,null,{"$f":"Table1[[#This Row],[ID_Locality]]&\".\"&Table1[[#This Row],[ID_Ind]]&Table1[[#This Row],[ID_Comp]]","v":"Pefal.9"},2,"GRPFM-9",{"$f":"VLOOKUP(Table1[[#This Row],[Code_Indic]],Dim_PEFA!$A$2:$B$13,2,FALSE)","v":"Legislative scrutiny of gender impacts of the budget"},null,null,9,1,{"$f":"VLOOKUP($M10,Input!$C$10:$I$30,4,FALSE)","v":"D"},{"$f":"VLOOKUP($M10,Input!$C$10:$I$30,7,FALSE)","v":1},"1. FAIBLE",{"$f":"IFERROR(AVERAGEIFS(Table1[Score Num],Table1[Year],Table1[[#This Row],[Year]],Table1[Code_Indic],Table1[[#This Row],[Code_Indic]],Table1[Score Num],\">0\"),0)","v":1},{"$f":"_xlfn.MINIFS(Table1[Score Num],Table1[Date],Table1[[#This Row],[Date]],Table1[Code_Indic],Table1[[#This Row],[Code_Indic]],Table1[Score Num],\">0\")","v":0},0.5,{"$f":"SUMIFS(Table1[Score Num],Table1[Code_Indic],Table1[[#This Row],[Code_Indic]])","v":4},{"$f":"(IF(Table1[[#This Row],[Method]]=1,Table1[[#This Row],[Min NumC]],Table1[[#This Row],[AVG Num]]))","v":1}]
{"$rows_left_out":34}
{"sheet":"ES (Synth table)","index":3,"n_rows":12,"n_cols":7,"rows_kept":12,"cut":false,"hidden":false,"merged":[[2,3,2,4]]}
[null,null,null,null,{"$f":"Profile!G11&\" \"&Input!D3&\" - \"&Profile!G12&\" \"&Input!D4","v":"Pefa Gender Pefalia - Year 2019"}]
[]
["Method",null,null,"Indicadores",null,1,2]
[null,null,1,{"$f":"Dim_PEFA!A3","v":"GRPFM-1"},{"$f":"Dim_PEFA!B3","v":"Gender impact analysis of budget policy proposals"},{"$f":"_xlfn.IFNA(INDEX(Data!$S$11:$S$22, MATCH(1,(F$3=Data!$J$11:$J$22)*($C4=Data!$I$11:$I$22), 0)),\"\")","v":"D"},{"$f":"_xlfn.IFNA(INDEX(Data!$S$11:$S$22, MATCH(1,(G$3=Data!$J$11:$J$22)*($C4=Data!$I$11:$I$22), 0)),\"\")","v":"A"}]
[null,null,2,{"$f":"Dim_PEFA!A4","v":"GRPFM-2"},{"$f":"Dim_PEFA!B4","v":"Gender responsive public investment management"},{"$f":"_xlfn.IFNA(INDEX(Data!$S$11:$S$22, MATCH(1,(F$3=Data!$J$11:$J$22)*($C5=Data!$I$11:$I$22), 0)),\"\")","v":"A"},{"$f":"_xlfn.IFNA(INDEX(Data!$S$11:$S$22, MATCH(1,(G$3=Data!$J$11:$J$22)*($C5=Data!$I$11:$I$22), 0)),\"\")","v":""}]
[null,null,3,{"$f":"Dim_PEFA!A5","v":"GRPFM-3"},{"$f":"Dim_PEFA!B5","v":"Gender responsive budget circular"},{"$f":"_xlfn.IFNA(INDEX(Data!$S$11:$S$22, MATCH(1,(F$3=Data!$J$11:$J$22)*($C6=Data!$I$11:$I$22), 0)),\"\")","v":"C"},{"$f":"_xlfn.IFNA(INDEX(Data!$S$11:$S$22, MATCH(1,(G$3=Data!$J$11:$J$22)*($C6=Data!$I$11:$I$22), 0)),\"\")","v":""}]
[null,null,4,{"$f":"Dim_PEFA!A6","v":"GRPFM-4"},{"$f":"Dim_PEFA!B6","v":"Gender responsive budget proposal documentation"},{"$f":"_xlfn.IFNA(INDEX(Data!$S$11:$S$22, MATCH(1,(F$3=Data!$J$11:$J$22)*($C7=Data!$I$11:$I$22), 0)),\"\")","v":"NA"},{"$f":"_xlfn.IFNA(INDEX(Data!$S$11:$S$22, MATCH(1,(G$3=Data!$J$11:$J$22)*($C7=Data!$I$11:$I$22), 0)),\"\")","v":""}]
[null,null,5,{"$f":"Dim_PEFA!A7","v":"GRPFM-5"},{"$f":"Dim_PEFA!B7","v":"Sex-disaggregated performance information "},{"$f":"_xlfn.IFNA(INDEX(Data!$S$11:$S$22, MATCH(1,(F$3=Data!$J$11:$J$22)*($C8=Data!$I$11:$I$22), 0)),\"\")","v":"D"},{"$f":"_xlfn.IFNA(INDEX(Data!$S$11:$S$22, MATCH(1,(G$3=Data!$J$11:$J$22)*($C8=Data!$I$11:$I$22), 0)),\"\")","v":"D"}]
[null,null,6,{"$f":"Dim_PEFA!A9","v":"GRPFM-6"},{"$f":"Dim_PEFA!B9","v":"Tracking budget expenditure for gender equality"},{"$f":"_xlfn.IFNA(INDEX(Data!$S$11:$S$22, MATCH(1,(F$3=Data!$J$11:$J$22)*($C9=Data!$I$11:$I$22), 0)),\"\")","v":"C"},{"$f":"_xlfn.IFNA(INDEX(Data!$S$11:$S$22, MATCH(1,(G$3=Data!$J$11:$J$22)*($C9=Data!$I$11:$I$22), 0)),\"\")","v":""}]
[null,null,7,{"$f":"Dim_PEFA!A10","v":"GRPFM-7"},{"$f":"Dim_PEFA!B10","v":"Gender responsive reporting"},{"$f":"_xlfn.IFNA(INDEX(Data!$S$11:$S$22, MATCH(1,(F$3=Data!$J$11:$J$22)*($C10=Data!$I$11:$I$22), 0)),\"\")","v":"D"},{"$f":"_xlfn.IFNA(INDEX(Data!$S$11:$S$22, MATCH(1,(G$3=Data!$J$11:$J$22)*($C10=Data!$I$11:$I$22), 0)),\"\")","v":""}]
{"$rows_left_out":3}
{"sheet":"Report Indic-Comp","index":4,"n_rows":47,"n_cols":33,"rows_kept":47,"cut":false,"hidden":false,"merged":[]}
[null,null,null,null,null,null,null,null,null,null,null,null,null,null,null,null,null,null,null,null,null,null,null,null,"Indic","Indic","Indic"]
[null,null,null,null,{"$f":"Profile!G13","v":"Scores by dimensions"},null,null,null,null,null,null,null,null,null,null,null,null,null,null,null,null,null,null,null,"AD","AD","AD"]
[]
[null,null,null,null,null,null,null,null,null,null,null,null,null,null,null,null,null,null,null,null,null,null,null,null,null,null,null,null,null,null,4,0,"A"]
[null,null,null,null,null,null,null,null,null,null,null,null,null,null,null,null,null,null,null,null,null,null,null,null,null,null,null,null,null,null,3.5,0,"B+"]
[null,null,null,null,null,null,null,null,null,null,null,null,null,null,null,null,null,null,null,null,null,null,null,null,null,null,null,null,null,null,3,0,"B+"]
[null,null,null,null,null,null,null,null,null,null,null,null,null,null,null,null,null,null,null,null,null,null,null,null,null,null,"xyChart","Value",null,null,2.5,0,"C+"]
[null,null,null,null,null,null,null,null,null,null,null,null,null,null,null,null,null,null,null,null,null,null,null,null,null,null,1,0,null,null,2,0,"C"]
[null,null,null,null,null,null,null,null,null,null,null,null,null,null,null,null,null,null,null,null,null,null,null,null,null,null,1.5,0,null,null,1.5,0,"D+"]
[null,null,null,null,null,null,null,null,null,null,null,null,null,null,null,null,null,null,null,null,null,null,null,null,null,null,2,0,null,null,1,0,"D"]
{"$rows_left_out":38}
{"sheet":"ES-Scores","index":5,"n_rows":31,"n_cols":9,"rows_kept":31,"cut":false,"hidden":false,"merged":[]}
[null,null,{"$f":"\"Number of dimensions by scores - Year \"&Input!D4","v":"Number of dimensions by scores - Year 2019"}]
[]
[null,null,null,null,null,null,null,null,{"$f":"Profile!$G$15","v":"Number of indicators per score"}]
[null,"Ind",{"$f":"\"PEFA \"&Input!D4","v":"PEFA 2019"}]
[null,"A",{"$f":"COUNTIFS(Input!A:A,\"Indic\",Input!F:F,B5)","v":1}]
[null,"B+",{"$f":"COUNTIFS(Input!A:A,\"Indic\",Input!F:F,B6)","v":0}]
[null,"B",{"$f":"COUNTIFS(Input!A:A,\"Indic\",Input!F:F,B7)","v":0}]
[null,"C+",{"$f":"COUNTIFS(Input!A:A,\"Indic\",Input!F:F,B8)","v":0}]
[null,"C",{"$f":"COUNTIFS(Input!A:A,\"Indic\",Input!F:F,B9)","v":2}]
[null,"D+",{"$f":"COUNTIFS(Input!A:A,\"Indic\",Input!F:F,B10)","v":1}]
{"$rows_left_out":22}
{"sheet":"PivotTable","index":6,"n_rows":13,"n_cols":2,"rows_kept":13,"cut":false,"hidden":true,"merged":[]}
["Method","(Multiple Items)"]
[]
["Average of Score num (Curr)"]
["ID","Total"]
["GRPFM-1",1.5]
["GRPFM-2",4]
["GRPFM-3",2]
["GRPFM-4",0]
["GRPFM-5",1]
["GRPFM-6",2]
{"$rows_left_out":4}
{"sheet":"Report Indic (Radar)","index":7,"n_rows":2,"n_cols":8,"rows_kept":2,"cut":false,"hidden":false,"merged":[]}
[]
[null,null,null,null,null,null,null,{"$f":"Profile!G14","v":"Scores by indicators"}]

{"sheet":"Dim_PEFA","index":8,"n_rows":13,"n_cols":4,"rows_kept":13,"cut":false,"hidden":true,"merged":[]}
["ID_Ind","Indicator","ID_Comp","Component"]
["GRPFM-1","Gender impact analysis of budget policy proposals","GRPFM-1.1","Gender impact analysis of expenditure policy proposals"]
["GRPFM-1","Gender impact analysis of budget policy proposals","GRPFM-1.2","Gender impact analysis of revenue policy proposals"]
["GRPFM-2","Gender responsive public investment management","GRPFM-2.1","Gender responsive public investment management"]
["GRPFM-3","Gender responsive budget circular","GRPFM-3.1","Gender responsive budget circular"]
["GRPFM-4","Gender responsive budget proposal documentation","GRPFM-4.1","Gender responsive budget proposal documentation"]
["GRPFM-5","Sex-disaggregated performance information ","GRPFM-5.1","Sex-disaggregated performance plans for service delivery"]
["GRPFM-5","Sex-disaggregated performance information ","GRPFM-5.2","Sex-disaggregated performance achieved for service delivery"]
["GRPFM-6","Tracking budget expenditure for gender equality","GRPFM-6.1","Tracking budget expenditure for gender equality"]
["GRPFM-7","Gender responsive reporting","GRPFM-7.1","Gender responsive reporting"]
{"$rows_left_out":4}
{"sheet":"Profile","index":9,"n_rows":105,"n_cols":26,"rows_kept":105,"cut":false,"hidden":true,"merged":[]}
["Year","Month","Score","Comparable","Status","PEFA check","names"]
[2016,"Jan","A",0,"Draft1","Yes","Justification for the evolution"]
[2017,"Février","B",1,"Draft2","No","Team Leader"]
[2018,"Mar","C",null,"Draft3",null,"Country"]
[2019,"Avr","D",null,"Final",null,"Evaluation year"]
[2020,"Mai","D*",null,null,null,"Evaluation PEFA Gender"]
[2021,"Juin","NA",null,null,null,"4. ADVANCED"]
[2022,"Juillet","NU",null,null,null,"3. GOOD"]
[2023,"Août",null,null,null,null,"2. BASIC"]
[2024,"Sept",null,null,null,null,"1. WEAK"]
{"$rows_left_out":96}
{"sheet":"colors","index":10,"n_rows":22,"n_cols":11,"rows_kept":22,"cut":false,"hidden":true,"merged":[]}
[1,"ELEMENTAIRE","Sec!Pefa2018",null,"Sheets with Charts with numeric data labels data",null,"Sheets with tables"]
[2,"BASIQUE",null,null,"Report Indic-Comp",null,"Sheet Name","Numeric Data Labels?","Start row","Start Column","Column used to find last row"]
[3,"3. Suffisant",null,null,null,null,"ES (Synth table)","N",3,4,4]
[4,"Avancé"]
[]
[]
[]
[]
[]
[]
{"$rows_left_out":12}